qt makefile error 2 Abbott Texas

Address 7524 Bosque Blvd, Woodway, TX 76712
Phone (254) 776-0300
Website Link http://www.hensonbusinessproducts.com
Hours

qt makefile error 2 Abbott, Texas

mingw32-make: *** [debug] Error 2 21:22:05: The process "C:\Qt\Qt5.3.2\Tools\mingw482_32\bin\mingw32-make.exe" exited with code 2. HouseCall … Sims 2 Bodyshop Error D3derr_invalidcall Aspyr Media Inc. Reply Quote 0 Saphrosit last edited by My PATH with "Clear system environment" check is: C:\QtSDK\Desktop\Qt\4.8.1\msvc2008\lib;C:\QtSDK\Desktop\Qt\4.8.1\msvc2008\bin Reply Quote 0 Loading More Posts 12 Posts 10415 Views Reply Reply as topic Log I can reproduce this problem if I check "Clear system environment" on the Projects' Build Settings page.

The system returned: (113) No route to host The remote host or network may be down. c++ qt debugging makefile share|improve this question edited Jun 24 '13 at 12:59 asked Jun 24 '13 at 10:19 Satya Kumar 101215 add a comment| 1 Answer 1 active oldest votes If you need anymore help let me know I'll be glad to help you. I suggest either build->clean followed by build->rebuild all Or just create a new EMPTY project and start again with the 4 files you downloaded.

For better understanding of problem can you share .pro file and complete build console output? Error while building project test (target: Desktop) When executing build step 'Make' @ Does anyone know what is the cause? I'm still having the same error. Browse other questions tagged c++ qt compiler-errors makefile or ask your own question.

Error while building project test (target: Desktop) When executing build step 'Make' Does anyone know what is the cause? c++ qt compiler-errors makefile share|improve this question asked May 3 '12 at 15:01 user1372813 40115 maybe using a minigw compiler will help you out. The Internet to find methods can not solve, say what add environment variables like ah The following error: Occasionally when constructing such do not move: Most often appear as follows: jom: As a result, your viewing experience will be diminished, and you have been placed in read-only mode.

Where did you install the cl.exe? Could there be instructions, not sure what to do with that link.Sorry. 0 Hunter Shutt · January 2, 2016 Ok so I've done that, and I know I'm running a 64-bit Reply Quote 0 leon.anavi last edited by There are "several similar threads at the forum":http://qt-project.org/search/tag/jom.exe Have you already seen them? I tried also to reinstall the entire SDK, but nothing changed[/quote] Please try this proposition from a "similar issue with jom described at stackoverflow.com":http://stackoverflow.com/questions/9408466/qt-compile-time-error bq.

more stack exchange communities company blog Stack Exchange Inbox Reputation and Badges sign up log in tour help Tour Start here for a quick overview of the site Help Center Detailed What to do with my pre-teen daughter who has been out of control since a severe accident? Error while building/deploying project untitled (kit: Desktop Qt 5.2.1 MSVC2012 32bit) When the step'Make' 09:34:23: Elapsed time: 00:01. I tried also to reinstall the entire SDK, but nothing changed Reply Quote 0 leon.anavi last edited by [quote author="Saphrosit" date="1336404861"]Yes I did it, but I keep getting the same error...

share|improve this answer edited Sep 1 '15 at 18:22 Mateusz Piotrowski 1,66441131 answered May 1 '15 at 17:51 Amir Hossein 92 add a comment| Your Answer draft saved draft discarded Should two DFAs be complete before making an intersection of them? NMAKE : fatal error U1077: 'cl' : return code '0x1' Stop. Can Feudalism Endure Advanced Agricultural Techniques?

I don't know if it's relevant or not, but before getting this error I got the common error about cl not found; I solved adding the path to cl in the To do that each time, you can create a .bat file which contains the following: C:\Program Files (x86)\Microsoft Visual Studio 10.0\VC\vcvarsall.bat {Path to QtCreator}\qtcreator (Correct the paths if your configuration is Join them; it only takes a minute: Sign up Qt - Error 2 at compile time up vote 3 down vote favorite I just downloaded Qt SDK 4.8.1 and, after installing The settings as shown below In the use of JOM instead of nmake removing the hook, a compiler error: NMAKE : fatal error U1077: ""C:\Program Files (x86)\Microsoft Visual Studio 11.0\VC\bin\cl.EXE"": The

Open a text file and remove any blank lines Help me remember which is which: "humoro" and "humuro" Would the phrase, "in my area," be a non-restrictive clause? Reply Quote 0 Saphrosit last edited by Unfortunately I cannot give an exact answer now (the computer is at the lab), I hope I will answer tomorrow. Is it safe for a CR2032 coin cell to be in an oven? What debugger should I be using?

I see you are using msvc –user123_456 May 12 '12 at 17:54 @denonth Yes, I'm using msvc. Quick Navigation C++ Programming Top Site Areas Settings Private Messages Subscriptions Who's Online Search Forums Forums Home Forums General Programming Boards C++ Programming C Programming C# Programming Game Programming Networking/Device Communication NMAKE : fatal error U1077: ""C:\Program Files (x86)\Microsoft Visual Studio 11.0\VC\bin\nmake.exe"": The return code"0x2" Stop. How to tell where file is going to be saved?

What is your PATH environment variable with clear system environment set? Your cache administrator is webmaster. Post a Reply Replies - page 1 Oldest Newest Rating 0 Hunter Shutt · January 2, 2016 So how do I do that? Clean, rerun qmake and rebuild the whole project.

Words that are anagrams of themselves Baking at a lower temperature than the recipe calls for Differentiation of sine in Fourier domain What exactly does it mean for a scalar function Can you explain further how to use minigw? –user1372813 May 14 '12 at 15:03 add a comment| 4 Answers 4 active oldest votes up vote 4 down vote I've solved it What did you install to get the compiler? Error while building/deploying project Server (kit: Desktop Qt 5.3 MinGW 32bit) When executing step "Make" I did the following to get rid of the error.

Can the notion of "squaring" be extended to other shapes? Reply Quote 0 leon.anavi last edited by Please share the content of your pro file. Set literal gives different result from set function call Steepest descent/gradient descent as dynamical system A Riddle - Mountains and Valleys Breaking effort on both Weak and Strong collision resistance hash more stack exchange communities company blog Stack Exchange Inbox Reputation and Badges sign up log in tour help Tour Start here for a quick overview of the site Help Center Detailed

Not the answer you're looking for? Then you can type: qmake and after that make and then you have built project If it doesn't work try to go trough the DOCUMENTATION to see how to use minigw So, you need to call vcvarsall.bat before lunch QtCreator. Qt - Developer Resources - documentation, guides, forums – Developer resources including Qt documentation, installation guides, forums, tutorials, etc for using the Qt cross-platform software development framework.

What reason is this excuse me Started by Hellen at October 14, 2014 - 8:43 PM Setting the compiler canPosted by Tommy at October 15, 2014 - 12:49 AM Dear ~ What is summer in Spanish? "Estío" vs "verano" Which lane to enter on this roundabout? (UK) more hot questions question feed lang-cpp about us tour help blog chat data legal privacy http://anavi.org/ Reply Quote 0 Saphrosit last edited by My "Clear system environment" box is already unchecked. This is related to Problem 2, though in this case it … but still installs without apparent error due to Windows tolerance for case error.

http://s22.postimg.org/iqosatggx/Scrshot6.png http://s22.postimg.org/d3sfdcdy9/Scrshot7.png http://s22.postimg.org/m2ihqdiu9/Scrshot8.png http://s22.postimg.org/4iz3m63s1/Scrshot9.png and I get this error http://s21.postimg.org/6z7t2mnx3/Scrshot11.png Code: 11:58:21: Running steps for project uwm... 11:58:21: Configuration unchanged, skipping qmake step. 11:58:21: Starting: "C:\Qt\Qt5.0.2\Tools\QtCreator\bin\jom.exe" C:\Qt\Qt5.0.2\Tools\QtCreator\bin\jom.exe -f Makefile.Debug Error: dependent My problem was an QMAKE_EXTRA_TARGETS entry in the .pro file (running an executable, probably a path issue, I have not investigated further yet). –handle Aug 5 '15 at 8:53 Just put that exact route in? 0 Hunter Shutt · January 4, 2016 Do I want to add theC:\Program Files (x86)\Microsoft Visual Studio 11.0\VC\bin\cl.exe orC:\Program Files (x86)\Microsoft Visual Studio 11.0\VC\bin 0 Your cache administrator is webmaster.

Reply Quote 0 tobias.hunger Moderators last edited by Saphrosit: Oh, that should not happen! Browse other questions tagged c++ qt debugging makefile or ask your own question. It seems that you are trying to build at a shadow build location, you may try in-place build and see if you get same error.